资讯动态

AXI4总线通道分离与握手机制:从原理到RTL实现避坑指南

发布时间:2026/10/29 12:11:22 来源:尧图企业网站定制
简介面向SOC设计与FPGA开发初学者及工程师的AXI4总线协议学习资料聚焦AMBA家族中应用最广的AXI4协议帮助读者系统理解五个独立通道、READY/VALID握手机制、突发传输与乱序收发等核心概念。资源包内含1个docx文档约3.27MB以图文结合方式梳理通道信号定义总览、读写通道信号对照表及握手时序分析并对写回应通道独立成通道的原因给出个人解读适合作为协议入门与查阅手册。目前已有425人学习下载。读者可从中获得按通道分类的信号速查表、握手成功的三种时序情形说明以及结合ZYNQ核中ARM与FPGA交互场景的实例讲解便于快速建立AXI4知识框架并为后续仿真验证打下基础。1. 五个通道不是设计炫技AXI4 到底在解决什么瓶颈很多人第一次看 AXI4 的信号表第一反应是“怎么这么多”。五个通道、几十根信号线光握手就要背半天。但如果你把视角拉回到总线要解决的核心矛盾上会发现这套设计其实是被逼出来的CPU 和内存、DMA 和外设之间的速度差越来越大传统总线那种“地址、数据、响应一把梭”的方式会让快的一方干等慢的一方。AXI4 的通道分离本质上是把一次传输拆成可以各自流动的流水线阶段让地址先走、数据跟上、响应后到中间谁慢谁自己扛着不拖累别人。这也是为什么它在 SoC 互联里几乎成了事实标准——不是因为它复杂而是因为它把“等待”这件事从全局问题降级成了局部问题。搞懂这套机制你再看任何一次总线卡顿、吞吐上不去、仿真对不上的问题都能顺着通道和握手这两条线摸到根上。2. 通道分离与信号定义为什么地址和数据必须各走各的路2.1 五通道的划分逻辑与方向约束AXI4 把一次读写拆成五个独立通道写地址、写数据、写响应、读地址、读数据。每个通道内部除了 READY 是从机往主机方向、VALID 是主机往从机方向之外其余信号方向完全一致。这个“方向一致”不是随手定的它直接决定了每个通道可以独立做流控。你想想如果地址和数据混在一条线上那地址阶段的有效性判断就得把数据线的状态也卷进来握手逻辑会变成一团乱麻。分开之后每个通道只需要管好自己的 VALID/READY 这一对通道之间通过 ID 和顺序约束来对齐复杂度被切碎了。从信号表里还能读出一个规律每个通道都带 ID 标签。写地址有 AWID读地址有 ARID读数据有 RID写响应有 BID。ID 是乱序收发的锚点——不同 ID 的传输任务之间没有顺序要求相同 ID 的必须按序完成。这就好比快递单号同一个单号下的包裹必须按顺序派送不同单号之间谁先到谁先送都行。没有 ID乱序就无从谈起因为从机根本不知道哪个数据包属于哪个任务。还有一个容易被忽略的点AXI4 把写通道的 WID 取消了。AXI3 时代写数据是带 ID 的支持交织写也就是不同写任务的数据可以穿插着来。但交织写对从机的缓冲管理要求很高实际 SoC 里用得极少。AXI4 干脆砍掉 WID规定写数据必须连续写顺序跟写地址顺序一致。这个取舍很务实——省掉一批端口和缓冲逻辑代价是放弃了写数据的交织能力而绝大多数场景根本不需要它。2.2 写响应为什么被单独拎出来写响应通道 BRESP 独立成通道网上常见的解释是“数据流向相反所以拆开”。这个说法站不住脚一个通道里多一两根反向信号影响远没有新增一整套 ID、VALID、READY 来得大。更合理的解释藏在传输频率里。一次突发写比如 16 拍数据从机只在收到最后一拍、确认整包完整之后才回一个 BRESP。前面 15 拍是不回响应的因为中途你没法判断这包数据到底收全了没有。所以写响应的使用频率是 1/16突发越长频率越低。而读不一样读数据通道里每一拍读数据都带一个 RRESP因为从机可能在某一拍返回 OKAY、下一拍返回 ERROR这个状态是逐拍表达的频率是 16/16。把低频的写响应单独拆出去让它不占用写数据通道的带宽和时序资源是划算的而读响应跟读数据同频硬拆反而增加端口开销留在读数据通道里更自然。提示理解这个频率差异后面做从机设计时你就不会纠结“为什么写响应要等 WLAST 之后才拉”——它不是延迟是协议本身就这么定义的。2.3 传输配置信号的参数化设计AWLEN、AWSIZE、AWBURST 这三组信号决定了一次突发的形状。AWLEN 是 8 位表示突发长度减一所以 INCR 类型下可以传 1 到 256 拍WRAP 类型限制更严只能是 2、4、8、16 拍。AWSIZE 是 3 位表示每拍字节数的以 2 为底的对数3b010 就是 4 字节。AWBURST 两位00 固定、01 递增、10 回环。回环传输的地址计算是很多人翻车的地方。公式不复杂先算对齐地址再算回环边界地址递增到边界就绕回起始地址。但手写 RTL 时如果直接用加法器做递增很容易在边界处多走一拍或少走一拍。常见的实现思路是把回环拆成“边界前”和“边界后”两段用比较器判断当前地址是否到达 Wrap_Boundary到了就强制赋回起始地址而不是靠自然溢出。// 回环地址计算的核心判断简化示意 // wrap_boundary 由起始地址和突发总字节数算出 always (*) begin if (cur_addr num_bytes wrap_boundary burst_total_bytes) next_addr wrap_boundary; // 绕回边界起点 else next_addr cur_addr num_bytes; // 正常递增 end这段逻辑的关键参数是 burst_total_bytes它等于 Number_Bytes 乘以 Burst_Len必须在传输开始前就算好并锁存不能在每拍重新算否则组合逻辑延迟会拖垮时序。另一个坑是 4KB 边界一个突发不能跨越 4KB 地址界限因为主机侧的地址解码是以 4KB 为粒度的跨过去就可能写到别的从机头上。做主机模型时如果不检查这个约束仿真能过上板就出玄学问题。3. 握手机制VALID 和 READY 的时序约束到底在防什么3.1 三种握手时序与顺序依赖VALID 和 READY 同时为高的那个时钟沿就是一次握手成功。按谁先拉高可以分三种情况VALID 先到、READY 先到、同时到。协议对这三种都接受但有一条铁律——VALID 一旦拉高在对应 READY 到来之前不能撤销也不能中途改数据。这条规则是为了防止死锁和误采样从机看到 VALID 就可以放心地在任意后续周期拉 READY不用担心数据半路变了。通道之间的顺序约束用箭头图表达单箭头表示被指向的信号可以在源信号有效之前或之后有效双箭头表示必须在源信号有效之后。读传输里ARVALID 和 ARREADY 之间没有先后要求但 RVALID 必须等这两个都握手成功之后才能拉高。写传输里BVALID 必须等写地址和写数据两个通道都握手完成、且 WLAST 已经拉高之后才能有效。这些约束翻译成 RTL 就是状态机的迁移条件不能靠“大概差不多”的时序去凑。3.2 从机写过程的 RTL 实现思路写从机的入口是 AWREADY。最朴素的写法是看到 AWVALID 就拉高 AWREADY 一个周期完成握手。但这里有个问题从机有没有能力在握手之后立刻处理下一笔如果没有缓冲就必须等当前写数据收完、响应发完才能接下一个地址。这就是 outstanding 机制要解决的问题。// 带一级 outstanding 缓冲的写地址握手简化 reg awready_r; reg addr_pending; // 已接收地址但数据未收完 always (posedge aclk or negedge aresetn) begin if (!aresetn) begin awready_r 1b0; addr_pending 1b0; end else begin // 缓冲空且当前无挂起地址时才允许握手新地址 if (awvalid !addr_pending !awready_r) awready_r 1b1; else awready_r 1b0; if (awvalid awready_r) addr_pending 1b1; // 锁存地址标记挂起 else if (wlast wvalid wready) addr_pending 1b0; // 最后一拍数据收完释放 end end这段代码里 addr_pending 就是 outstanding 深度的体现。深度为 1 时从机在收数据期间不再接新地址深度为 N 时就要用 FIFO 存地址和配置信息每收完一包弹一个。参数怎么定看你的数据通路能跑多快、从机内部处理延迟多大。深度太浅主机地址发不进来吞吐上不去深度太深FIFO 面积和时序压力都上来。我一般会先按最坏情况的延迟估算再留一拍余量。WSTRB 的处理也值得单独说。32 位数据总线对应 4 位 WSTRB每一位管一个字节。窄传输时比如 AWSIZE 表示 1 字节WSTRB 就只在对应字节位置 1其余为 0。非对齐传输时起始地址不在寄存器边界上第一拍的 WSTRB 可能是 4b1000 这种形式。写寄存器时不能直接整字覆盖要按 WSTRB 做字节使能的掩码写否则会把没选中的字节也改掉。4. 避坑与排查仿真对不上时先查这几处4.1 现象仿真能跑通上板读写数据错位原因通常是 WSTRB 没有正确参与写使能。仿真模型有时对整字写比较宽容但真实寄存器阵列严格按字节使能。解决方法是把写逻辑改成按字节掩码reg[i] wstrb[i] ? wdata[8*i7:8*i] : reg[i]逐字节判断不要图省事直接整字赋值。4.2 现象突发传输到一半卡死VALID 一直高但 READY 不来先查 4KB 边界。如果主机发出的突发跨越了 4KB 界限从机的地址解码可能把后半段路由到不存在的区域READY 自然不响应。排查时把 AWADDR、AWLEN、AWSIZE 打出来手算一下结束地址是否越过(AWADDR ~12hFFF) 4KB。另一个可能是 WLAST 没在正确的拍拉高从机等不到结束标志就不释放状态。4.3 现象写响应迟迟不回或回了但 ID 对不上检查 BVALID 的拉高条件是否严格满足“写地址握手完成 写数据 WLAST 握手完成”。有些实现为了省事在 WLAST 一拍就拉 BVALID但此时写地址通道可能还没握手完顺序就错了。另外 BID 必须跟 AWID 一致如果从机内部把 ID 丢了或者用了默认值主机的乱序跟踪就会错乱。4.4 现象回环传输地址跳变不符合预期回环的 Wrap_Boundary 计算依赖起始地址和总字节数如果起始地址本身没对齐到传输大小边界算出来就是错的。协议要求回环传输的起始地址必须对齐到传输大小做主机模型时要先检查这个前提不满足就别发 WRAP 类型。从机侧则要在每拍比较当前地址和边界用组合逻辑算下一拍地址别用累加器硬推。5. 设计取舍通道分离的代价与 outstanding 的边界AXI4 这套机制走到今天核心取舍其实就一句话用端口和协议复杂度换流水线自由度。五个通道意味着五套握手、五组 ID 跟踪面积和验证工作量都比 AHB 那种单通道总线高出一截。但换回来的是地址可以先发、数据可以后到、不同任务可以乱序完成这在多主多从的 SoC 里是刚需。你要是做一个只有一个主一个从、流量又很规整的小系统用 AXI4 确实有点杀鸡用牛刀这也是 AXI4-Lite 存在的理由——砍掉突发和乱序保留握手和通道分离的基本骨架。outstanding 深度是另一个典型的取舍点。深度为 1 时逻辑最简单但主机发完地址就得等数据通道空出来才能发下一个流水线断断续续。深度加大能提升吞吐但地址 FIFO、ID 跟踪表、响应重排逻辑都要跟着长。我见过不少设计为了追吞吐把深度拉到 8 甚至 16结果时序收敛不了最后靠插寄存器解决反而增加了延迟。比较稳妥的做法是先按目标带宽和从机响应延迟算一个理论下限仿真里逐步加压看瓶颈在哪再决定加不加深度。验证这套东西光看波形不够。我习惯在 testbench 里加一个协议检查器专门盯三件事VALID 拉高后有没有中途撤销、WLAST 和 BVALID 的顺序对不对、突发有没有跨 4KB。这三条一旦违反后面所有数据比对都是白搭。从那以后我每次搭 AXI 从机都强制先把握手状态机和 WSTRB 掩码写对再往上叠功能不然调到最后根本分不清是协议错还是逻辑错。希望帮到你。本文还有配套的精品资源点击获取

读完文章,也想定制专属网站?

尧图设计师 24 小时内与您沟通定制方案

免费获取报价 →
↑