资讯动态

AXI to APB桥安全边界:PPROT透传、超时与地址译码

发布时间:2026/10/26 17:10:28 来源:尧图企业网站定制
简介面向FPGA与SoC嵌入式开发者的Xilinx AXI to APB Bridge v3.0 LogiCORE IP官方产品指南聚焦AXI4-Lite主设备与APB从外设之间的协议转换与互联设计适合需要集成低速外设、梳理总线时序或进行Vivado IP核配置的初中级工程师查阅对关注总线安全隔离与TrustZone/TEE环境互联的读者也具有底层参考价值。压缩包仅含1个PDF文件大小约1.11MB版面保留原厂文档的章节结构便于按需检索。内容覆盖特性与授权、AXI4-Lite从接口、APB主接口、标准符合性、资源占用和端口定义并延伸到时钟复位设计、时序图、IP定制生成、约束、仿真、综合实现及示例工程目录与仿真流程。已有1859人学习可作为总线桥接选型、接口联调和教学参考的案头资料。1. 协议桥的真实难点三根保护位与一个超时计数器AXI to APB bridge 在很多人眼里是一根不用动脑子的转接线一头接 AXI4-Lite一头接 APB3/APB4地址原样转发数据原样搬运能跑通就行。真做过带 security 需求的 SoC 集成之后结论会反过来——这类桥最脆的地方不是协议翻译而是那几根保护位PPROT和超时兜底它们直接决定 TrustZone/TEE 划出来的安全边界是不是纸糊的。地址译码错一位整条 APB 总线上的外设可能全部失联保护位丢一根非安全世界就能摸到本该隔离的寄存器没有超时机制一个不肯拉高 PREADY 的外设就能把 CPU 挂在那里等到复位。这三件事都不在“翻译”层面却都发生在桥里面。2. 节拍差AXI4-Lite 的五通道并发怎么压进 APB 的两相位2.1 两条总线的时序模型根本不是一个形状AXI4-Lite 把一次传输拆成五个独立通道AW写地址、W写数据、B写响应、AR读地址、R读数据。每个通道有自己的 VALID/READY 握手地址和数据是解耦的——写数据可以先于写地址到达也可以晚到桥不能假设它们同时出现。AXI4-Lite 去掉了 ID 信号因此不存在乱序响应但“地址与数据分离”这一条保留了下来。APB 完全相反。它没有通道概念一次传输被硬性切成两个相位Setup 相位PSEL 拉高、PENABLE 保持低和 Access 相位PSEL 保持高、PENABLE 拉高Access 相位要一直保持到从设备把 PREADY 拉高为止。地址、方向、写数据全部在 Setup 相位就已经摆好Access 相位只是“等对方点头”。维度AXI4-LiteAPB3/APB4握手单元每通道独立 VALID/READY全局 PSEL/PENABLE/PREADY地址与数据可分离、可不同周期到达同一拍内全部稳定最小事务周期地址拍 数据拍可重叠流水Setup 拍 Access 拍不可省错误反馈RRESP/BRESP 两比特编码PSLVERR 一根线保护属性AxPROT[2:0]PPROT[2:0]仅 APB4形状不同意味着桥内部必须有一个“事务寄存器组”把 AXI 侧散落在不同通道、不同时刻的信息收拢成一份完整的快照地址、方向、写数据、写选通、保护属性再按 APB 的节拍一拍一拍播放出去。这个寄存器组的大小直接决定了桥能不能支持 outstanding而这类桥的一个关键取舍就是不支持。2.2 四状态机为什么够用把上面的分析落到 RTL最小可工作的状态机只需要四个状态。下面这段是常见的实现思路不是某份源码的逐行复制但结构基本一致// 把 AXI 的一次握手折叠成 APB 的 Setup/Access 两拍 localparam IDLE 2d0, SETUP 2d1, ACCESS 2d2, RESP 2d3; always (posedge aclk or negedge aresetn) begin if (!aresetn) begin state IDLE; apb_psel 1b0; apb_penable 1b0; wait_cnt 0; end else begin case (state) IDLE: begin if (arvalid) begin // 读优先先看读通道 addr_lat araddr; prot_lat arprot; is_read 1b1; state SETUP; end else if (awvalid wvalid) begin addr_lat awaddr; prot_lat awprot; wdata_lat wdata; wstrb_lat wstrb; is_read 1b0; state SETUP; end end SETUP: begin apb_psel 1b1; // 地址/方向在此拍稳定 apb_penable 1b0; state ACCESS; end ACCESS: begin apb_penable 1b1; // 第二拍起保持到 PREADY if (apb_pready || apb_timeout) state RESP; end RESP: begin apb_psel 1b0; apb_penable 1b0; state IDLE; // 下一拍给 BVALID 或 RVALID end endcase end end四个状态的分工很明确IDLE 负责在两条通道之间做选择并锁存SETUP 负责把地址摆上 APB 并让 PSEL 拉高ACCESS 负责等待 PREADY 或超时RESP 负责撤掉 PSEL 并在下一拍给出 AXI 响应。注意 RESP 是独立状态而不是在 ACCESS 里顺手拉 BVALID——APB 的 PSEL 必须干净地落回 0否则从设备的状态机会认为还有一笔传输没结束这个细节在后面避坑章会再提一次。addr_lat、wdata_lat这组锁存寄存器就是前面说的“事务快照”。它的存在解释了为什么这类桥一次只能处理一个事务机器里只有一份快照第二笔 AXI 事务进来会覆盖第一份。想让吞吐翻倍就得复制整套寄存器组和 APB 状态而 APB 本身就是串行总线复制了也没有并行的余地。2.3 读优先不是随手写的代价也很实在文档里有一句容易被略过的话读写同时请求时读优先于写。这不是笔误是刻意的仲裁策略。理由在延迟敏感度上。AXI 读通常是阻塞性的——CPU 取指、取数、驱动读寄存器后面一串指令都等着这份数据写多数情况下可以缓冲写出去就完事B 响应晚几拍没人介意。让读先走能把最坏情况下的读延迟压下来这对实时性和中断响应是实打实的收益。代价是写饥饿。如果主设备持续不断发读请求写通道可能长时间拿不到仲裁权写缓冲被填满后主设备侧的 WREADY 就得拉低反压回上游。这种饥饿在真实系统里往往不表现得那么明显因为读流量天然是阵发的但在 DMA 持续搬运 CPU 轮询的场景下会暴露出来写延迟抖动变大偶发超时。所以这条策略的隐含前提是上游得保证读请求不会无限连发。如果是自己搭的总线矩阵最好在仲裁器那一层给写留一个保底窗口比如连续 N 笔读之后强制插入一笔写。桥本身不做这个它只负责“读优先”这四个字公平性得由上层补。3. 地址译码一个 4GB 空间怎么扇出到最多十六个从设备3.1 桥一个地址位都不改文档里写得很干脆AXI 的存储映射和 APB 的存储映射是同一个完整的 32 位4GB空间桥不对 APB 地址做任何修改APB 上出现的地址就是 AXI 上收到的地址。这句话看起来像废话实际是整份文档里最有分量的约束之一。它意味着桥是一个纯组合的地址通路m_apb_paddr s_axi_araddr或awaddr中间没有基址加减、没有窗口重映射、没有对齐修正。好处是延迟低、逻辑少、软件视角统一——CPU 看到的地址和外设看到的地址是同一个数值调试时不用在心里做一次翻译。坏处是所有地址规划的责任都推给了系统集成方外设的地址窗口必须和 AXI 侧的译码区间严格对齐错一位就是访问到别的从设备。顺带一个常被忽略的点AXI4-Lite 要求传输地址按传输宽度对齐桥不做非对齐拆分。32 位总线上一个0x1002的读请求不会自动变成两次 16 位访问它会原样出现在 APB 上由从设备自己决定怎么响应。绝大多数外设会返回错误或者读到错位数据——这类问题的现场表现是“某个寄存器读出来高 halfword 和低 halfword 错位”查起来相当费时间。3.2 译码器和多路选择器PSEL 扇出、PRDATA 收敛桥内部可以抽象成两级一级是地址译码把 32 位地址变成一组 one-hot 的 PSEL另一级是读数据多路选择把多个从设备的 PRDATA 收敛成一份送回 AXI。// 地址译码每个从设备一段地址窗口高位比较低位直通 generate for (i 0; i NUM_SLAVES; i i 1) begin : g_dec assign psel[i] apb_active ((paddr ~MASK[i]) BASE[i]); end endgenerate // 读数据选择只让被选中的从设备驱动 PRDATA always (*) begin prdata_mux 32h0; for (i 0; i NUM_SLAVES; i i 1) if (psel[i]) prdata_mux prdata_i[i]; endMASK[i]是窗口掩码BASE[i]是基地址两者相与再比较等价于“地址高位匹配”。apb_active是个门控信号保证只有在桥真正发起传输时 PSEL 才可能为高避免空闲期误选。代码本身不复杂值得说的是端口形态。这类桥在 APB 侧并不是一根共享的 PRDATA 总线而是每个从设备一组独立的m_apb_prdata/m_apb_pready/m_apb_pslverr输入编号从 0 一路排到 15。原因很实在FPGA 内部没有三态总线综合工具会把三态推断成 MUX 加一堆麻烦的时序路径直接用独立端口 显式多路选择时序可预测面积也好估。这也解释了资源占用表里“从设备数量”这一列从 1 个加到 8 个LUT 从三百多涨到四百多涨的主要就是译码比较器和多路选择的位宽。代价是端口数量随从设备线性增长。16 个从设备意味着 16 组 32 位读数据加 16 根 PREADY顶层连线会很难看。实践中多数设计只用 4 到 8 个剩下的从设备挂在别的桥上或者走另一级互连。3.3 PREADY 和 PSLVERR 的归约谁说了算多个从设备汇聚到一根 APB 通道上响应信号必须做归约而归约规则错了就是经典的总线挂死。PREADY 的正确做法是只取当前 PSEL 有效的那一路。未选中的从设备即使把 PREADY 拉低很多 IP 在未选中时输出不定或者恒 0也不能影响桥的等待逻辑// 只让被选中的从设备决定 PREADY / PSLVERR always (*) begin pready_mux 1b0; pslverr_mux 1b0; for (i 0; i NUM_SLAVES; i i 1) if (psel[i]) begin pready_mux pready_i[i]; pslverr_mux pslverr_i[i]; end end如果不做这个门控直接对所有 PREADY 取与只要有任何一个从设备恒为 0整条总线就永远等不到完成——现场表现是“访问某个外设正常一加上另一个外设就全局挂死”属于最难定位的一类问题。PSLVERR 的归约同理。它是 APB 侧唯一的错误信号一根线代表一次传输失败没有错误类型区分。桥收到之后要翻译成 AXI 的 SLVERR2b10放进 BRESP 或 RRESP。注意 AXI 的响应编码有四种OKAY、EXOKAY、SLVERR、DECERR。APB 只可能产生 OKAY 或 SLVERR 两种语义DECERR 保留给“地址根本没有落到任何从设备窗口”的情况——这一条是桥自己判的APB 上不会出现。混淆这两者的后果是软件侧的错误处理分不清“外设说这地址读不了”和“这地址压根没外设”驱动里的重试逻辑会做错决定。4. 安全属性透传PPROT 与 TrustZone/TEE 的边界到底落在哪4.1 三个 bit 的对应关系涉及 security 的集成里最常被问的问题是AXI 上的安全属性怎么传到 APB 上答案在 APB4 的 PPROT 里位定义和 AXI 的 AxPROT 是一一对应的。位AxPROT 含义PPROT 含义仅 APB4[0]0 非特权1 特权0 normal1 privileged[1]0 安全1 非安全0 secure1 non-secure[2]0 数据访问1 指令访问0 数据访问1 指令访问因为位定义完全一致桥在这条路径上的实现可以简单到极致m_apb_pprot prot_lat直通。文档里对 PPROT 的描述也印证了这个语义——它指示事务的 normal、privileged、secure 保护级别以及是数据访问还是指令访问。这份“简单”恰恰是它重要的原因。TrustZone 划出来的安全世界与非安全世界在总线层面就体现为AxPROT[1]这一个比特。安全主设备发出的访问该位为 0非安全主设备为 1。外设比如某个安全定时器、密钥寄存器组靠这位判断该不该响应。桥在这里只要做错一件事——比如把这个位固定接 0或者只在写通道接、读通道没接——安全隔离就整体失效而且失效得极其安静功能完全正常只是非安全世界也能读到密钥。4.2 APB3 的保护位缺失一个必须显式处理的风险APB3 没有 PPROT也没有 PSTRB。桥可以配成 APB3 或 APB4 模式配成 APB3 时这两个信号根本不存在。这意味着如果系统里存在安全/非安全的分区需求而桥被配置成 APB3 去接一个安全外设那么安全属性在桥这里就断了——外设拿不到任何提示它无法区分这次访问来自哪个世界。此时唯一的保护手段不在桥里而在上游必须保证非安全主设备在互连层面就访问不到这段地址比如用地址空间控制器或者总线防火墙在 AXI 侧拦截。这是设计评审里经常翻车的地方。集成方看到“支持 APB3/APB4 可选”就随手选了 APB3因为旧 IP 只支持 APB3然后以为桥会自动处理安全属性。文档不会替你报警它只写“设为 APB4 时驱动 pstrb 和 pprot”。选型时把这句话读成“要在安全场景用就必须选 APB4”能省掉一轮返工。4.3 桥只搬运不裁决还有一个更根本的认知要摆正桥是属性搬运工不是访问控制点。它做的事情是把 AxPROT 原样放到 PPROT 上把 PSTRB 原样放到 PSTRB 上然后等 PREADY。它不检查这位是否合法不比对地址是否落在该安全域允许的范围内不产生任何“权限拒绝”的响应。真实系统里的隔离判定至少要落在三个位置之一主设备侧的 TrustZone 控制器、互连侧的安全防火墙、从设备自身的寄存器访问控制。桥不在其中。这个分工是合理的因为桥拿不到足够的信息做裁决——它不知道安全世界的地址映射表也不知道当前哪个主设备在跑。真要让它做检查就得在桥里塞一张可配置的地址权限表面积和验证成本都会翻倍而且策略变更要改硬件。把裁决放在互连或者从设备侧策略可以由软件在启动阶段配置灵活得多。所以集成时的检查清单应该长这样安全外设必须挂在支持 PPROT 的桥APB4后面桥的上游必须有能拦截非安全访问的机制外设自己必须真的用 PPROT[1] 做判断而不是忽略它。三条缺一条TrustZone 的边界在那条路径上就是形式上的。5. 排查清单这五类问题几乎每个集成项目都会撞上5.1 现象只写了一个字节相邻字段被清零原因几乎总是 APB3 模式下 PSTRB 消失。AXI 侧带了wstrb 4b0001桥在 APB3 模式没有 PSTRB 可驱动从设备收到的是一个完整的 32 位写把其余三个字节按 PWDATA 上的值很可能是 0覆盖掉。软件侧看到的现象是“改了一个配置位同寄存器的其他位莫名归零”。解决办法有两条路。首选是把桥和外设都升级到 APB4让 PSTRB 完整透传从设备内部按字节使能更新寄存器。如果外设 IP 无法改动只能在软件侧做读-改-写并且要保证这段读改写是原子的关中断或者用独占访问的上层机制否则并发场景下依然会丢更新。还有一种做法是在外设外面包一层字节使能适配逻辑用 AXI 侧的 WSTRB 手动展开成四组写使能成本不高但端口要改。5.2 现象某次读操作永远不返回CPU 卡死到看门狗复位这是 PREADY 不归零的典型症状。要么是未选中的从设备把 PREADY 拉低且没有被 psel 门控要么是被选中的从设备自身状态机没初始化好、等一个永远不会来的条件。先确认桥有没有配数据相位超时。这类桥支持可选的超时机制超时后桥会自己造一个 SLVERR 响应回 AXI把主设备从等待里捞出来。超时值不能太小正常访问慢速外设可能就要几十个周期也不能太大软件侧等不起。经验值是按最慢外设的最坏响应时间的 2 到 3 倍来设再留一点余量。如果超时已经开了还是挂死问题多半在超时计数器本身没有被正确清零——比如在 RESP 状态忘了复位wait_cnt导致下一笔传输一开始就处于超时判定里。仿真阶段加一条断言任何一次 APB 传输的 Access 相位持续周期数不得超过超时阈值超了立刻报错。这条断言能挡掉后面 90% 的挂死类问题。5.3 现象仿真通过上板偶发读写错误重跑又好了先查时钟。这类桥只支持 AXI 与 APB 1:1 的同步时钟比两侧必须同频同相。有人看到两个时钟频率一样就以为能接实际上一个是 PLL 出来的、相位偏了几十度或者在布局后时钟树插入延迟不同跨过去就是亚稳态表现出来就是偶发错误、换一次综合就好、温度一变又坏。正确做法是两侧用同一个时钟源桥的s_axi_aclk和 APB 侧时钟接同一根网线不要中间插 BUFG 之外的东西。如果架构上确实需要异步那就不该用这类同步桥得换成带异步 FIFO 的互连或者自己做跨时钟处理且要严格约束。同类的还有复位。复位期间 PSEL 必须是 0复位释放要同步。如果复位异步撤销APB 从设备可能在 PSEL 上采到一个毛刺把状态机推进一个非法态之后所有访问都错位。这种问题在仿真里往往因为复位时序理想而看不到。5.4 现象访问某个地址返回错误换一个地址就正常查译码窗口是否重叠。两个从设备的BASE/MASK组合如果覆盖了同一段地址one-hot 的 PSEL 就会变成多热两个从设备同时被选中PRDATA 多路选择器按循环顺序取最后一个读回来的数据取决于综合结果——这种 bug 换一次工具版本可能就换一个表现非常难查。还有一种情况是地址落在所有窗口之外。此时没有任何 PSEL 有效桥应该在超时后返回 DECERR 而不是傻等。但很多实现里超时逻辑挂在“PSEL 有效但 PREADY 不来”这个条件上地址未映射时 PSEL 全 0超时根本不触发表现为永久挂起。修法是把未映射判定做成显式分支译码结果全 0 时直接进 RESP 状态并给出 DECERR不要进 APB 相位。6. 设计取舍为什么这桥只做 1:1、单事务、32 位把前面几章的分析收拢会发现这类桥的所有“限制”其实都是同一组取舍的不同侧面。限制换来的好处适用判断只支持 1:1 同步时钟无跨时钟逻辑无异步 FIFO面积和验证成本最低APB 外设与 AXI 主设备同源时钟时成立单事务、无 outstanding一份事务快照就够状态机四态收敛时序易收敛APB 本身串行流水化收益有限地址位宽固定 32 位译码器规模可控与 4GB 单一地址空间一致外设寄存器空间远小于 4GB够用不做安全检查只透传 PPROT无需可配置权限表策略交给软件上游必须有拦截机制兜底读优先仲裁读延迟可预期实时性有保障上游需保证写不被饿死这些选择指向同一个设计哲学桥应该尽可能“薄”。它处在总线层级的最低端上面是复杂的互连和缓存一致性域下面是几个傻乎乎的外设寄存器。任何加进桥里的智能——跨时钟、乱序、权限裁决——都会带来验证成本的指数增长而收益在这个位置上通常很有限。真正需要那些能力的地方应该在互连层解决。验证这套东西不建议只跑功能仿真。至少要做三件事一是用 APB 协议检查器很多仿真器自带 VIP盯住 PSEL/PENABLE/PREADY 的时序合法性尤其是 PSEL 在 Access 相位不能掉二是构造四类响应各来一遍——正常 OKAY、从设备 PSLVERR、地址未映射 DECERR、从设备不响应触发超时——确认软件侧的错误处理路径都被走到三是对译码器做一次形式化检查证明任意地址下 PSEL 的 one-hot 性成立这条比写一百个定向用例都管用。血泪经验是我曾经在一个项目里因为省事把桥配成了 APB3 去接一个带安全属性的外设功能测试全过安全评审时才发现 PPROT 根本没连出去整条路径的隔离是假的最后不得不改 IP 配置、重跑综合、重做时序收敛多花了两周。从那以后我每次集成这类桥都强制走一遍三查查 PPROT 有没有真的连到外设、查超时有没有开且计数器有没有清零、查译码窗口有没有重叠。这三条查完剩下的基本就是常规调试了。希望帮到你。本文还有配套的精品资源点击获取

读完文章,也想定制专属网站?

尧图设计师 24 小时内与您沟通定制方案

免费获取报价 →
↑