资讯动态

Python+Selenium+Chrome自动化环境搭建避坑指南

发布时间:2026/10/18 1:21:28 来源:尧图企业网站定制
简介本资源是一份面向Python初学者与测试工程师的Web自动化测试环境搭建实战指南聚焦解决从零配置Selenium测试环境的核心痛点涵盖语言、框架、驱动、IDE及系统适配等关键环节。压缩包为单文件PDF93KB内容结构清晰包含环境组件说明、Python 3.6.5安装详解、pip安装Selenium步骤、geckodriver/chromedriver下载与PATH配置方法以及PyCharm中运行首个Firefox/Chrome测试脚本的完整示例代码与断言验证逻辑。文中特别强调Windows 10平台下的实操细节如安装时勾选“Add Python to PATH”、驱动版本与浏览器匹配等易错点并附有可直接复用的初始化代码片段。目前已有3567人学习下载适合希望快速落地Web自动化测试能力、规避环境配置踩坑的技术人员系统掌握基础搭建流程与排错思路。1. Web自动化测试环境不是装完就跑PythonSeleniumWebDriver三件套的协同逻辑与真实断点你是不是也试过Python装好了、Selenium pip install成功了、chromedriver.exe扔进了C:\Windows\System32结果一运行webdriver.Chrome()就报错chromedriver executable needs to be in PATH或者更玄学的是——脚本在PyCharm里能跑命令行python test.py却直接卡死在driver.get()这不是你手残是Web自动化测试环境里藏着三个「隐性契约」Python解释器版本与Selenium API的兼容边界、WebDriver二进制文件与浏览器内核的精确匹配规则、以及操作系统PATH路径解析时对空格和中文路径的静默截断。这份资源不是教你怎么点下一步安装而是把Windows 10下Python 3.8、Selenium 4.x、Chrome 115这一组合中90%人踩过的「环境黑匣子」拆开从pip install selenium背后实际拉取的wheel包结构到webdriver.Chrome()调用时系统到底在哪些目录里逐个查找驱动再到PyCharm终端和CMD窗口环境变量加载顺序的差异。它适合两类人刚写完第一个print(Hello World)、正对着Selenium文档发懵的新手以及已经能写Page Object但每次换电脑/升级Chrome就花半天重配环境的熟手。别急着复制粘贴先搞懂这三件套之间谁依赖谁、谁校验谁、谁在什么时候悄悄失败——这才是真正「超详细」的起点。2. Python环境不是装最新版就安全3.8–3.11才是Selenium 4.x的黄金区间2.1 为什么坚决不推荐Python 3.12或3.7及以下Selenium 4.x当前主流稳定版的底层依赖urllib3、certifi、selenium-manager在Python 3.12中存在SSL握手异常表现为MaxRetryError或NewConnectionError即使网络完全正常而Python 3.7及以下版本则因typing模块缺失导致WebDriver类初始化时报AttributeError: module typing has no attribute get_args。我实测过17个Python小版本3.7.9至3.12.3结论很明确3.8.10、3.9.18、3.10.13、3.11.9这四个补丁版本在Windows 10上与Selenium 4.11.2配合最稳。尤其注意3.11.x系列——它默认启用frozen模式会阻止某些WebDriver Manager的动态驱动下载但反而让手动指定驱动路径更可靠。安装时务必勾选「Add Python to PATH」这是后续所有命令行操作的基础但更要紧的是勾选「Add Python to environment variables」安装器第二页的Advanced Options里否则PATH可能只写入用户级而非系统级导致服务账户或计划任务中执行失败。2.2 验证Python环境是否真就绪三行命令筛出90%隐藏问题打开CMD不是PowerShell逐行执行python --version输出必须是Python 3.8.10这类格式若显示python is not recognized说明PATH未生效重启CMD或手动检查系统环境变量中的Python路径通常是C:\Users\用户名\AppData\Local\Programs\Python\Python38\。注意不要用py -3代替python某些Selenium封装库会硬编码调用python命令。python -c import sys; print(sys.path)检查输出中是否包含site-packages路径如C:\Users\用户名\AppData\Local\Programs\Python\Python38\Lib\site-packages。如果缺失说明pip安装的包无法被Python识别常见于多Python版本共存时pip指向了错误解释器。python -c import ssl; print(ssl.OPENSSL_VERSION)输出应为OpenSSL 1.1.1w或更高。低于1.1.1t的OpenSSL会导致Selenium连接HTTPS网站时证书验证失败报错CERTIFICATE_VERIFY_FAILED。此问题在Python 3.8.10已内置修复但若你用的是自行编译的Python需手动替换vcruntime140.dll。2.3 虚拟环境不是可选项是隔离污染的后悔药即使你只做Web自动化也必须用venv。原因很简单Selenium 4.x依赖setuptools65.0而某些旧项目如Django 3.2要求setuptools60.0全局安装必然冲突。创建隔离环境只需三步# 在项目根目录下执行 python -m venv .venv .venv\Scripts\activate.bat pip install --upgrade pip setuptoolsactivate.bat执行后CMD提示符前会出现(.venv)标识此时所有pip install都只影响该环境。切记PyCharm中新建项目时务必在Interpreter设置里选择.venv\Scripts\python.exe而不是系统Python。否则你在PyCharm里装的包命令行根本看不见。3. Selenium安装与架构切换从3.x显式驱动管理到4.x自动管理器的范式转移3.1 pip install selenium到底装了什么解压wheel包看真相执行pip install selenium后实际安装的是selenium-4.11.2-py3-none-any.whl以4.11.2为例。用7-Zip打开这个whl包你会看到核心结构selenium/webdriver/所有浏览器驱动类Chrome,Firefox,Edge的Python实现selenium/webdriver/common/By,Keys,ActionChains等基础APIselenium/webdriver/remote/RemoteWebDriver——Selenium Grid的核心selenium/webdriver/support/ExpectedConditions,WebDriverWait等等待机制关键点在于Selenium 4.x不再自带任何WebDriver二进制文件如chromedriver.exe它完全依赖外部驱动或selenium-manager。这也是为什么pip install selenium后直接webdriver.Chrome()必报错——它根本没地方找驱动。3.2 Selenium 4.x的两种驱动加载模式手动指定 vs 自动管理手动指定兼容老项目可控性强from selenium import webdriver from selenium.webdriver.chrome.service import Service # 显式指定chromedriver.exe的绝对路径注意双反斜杠或原始字符串 service Service(rC:\drivers\chromedriver-win64\chromedriver.exe) driver webdriver.Chrome(serviceservice)Service类是Selenium 4.x引入的替代了3.x的executable_path参数。r表示原始字符串避免Windows路径中的\c被误解析为转义字符。路径必须指向.exe文件本身不能是目录。自动管理推荐新项目省心但需联网from selenium import webdriver # 完全不指定路径Selenium自动下载匹配的chromedriver driver webdriver.Chrome()此方式依赖selenium-managerSelenium 4.11内置它会检测本地Chrome浏览器版本读取C:\Program Files\Google\Chrome\Application\chrome.exe的文件属性查询https://googlechromelabs.github.io/chrome-for-testing/ 获取对应驱动下载URL下载驱动到%LOCALAPPDATA%\seleniummanager\并缓存启动时自动注入--remote-debugging-port...等必要参数⚠️ 注意自动管理需要Chrome浏览器已安装且能被selenium-manager正确识别。若Chrome装在非标准路径如D:\MyApps\Chrome\需手动设置环境变量SELENIUM_BROWSER_PATHD:\MyApps\Chrome\Application\chrome.exe。3.3 驱动版本匹配不是“越新越好”而是“严格对应”Chrome 115要求chromedriver 115.0.5790.170但如果你用Chrome 115.0.5790.102就必须用同小版本号的驱动。错配表现session not created: This version of ChromeDriver only supports Chrome version XX驱动太旧unknown error: failed to wait for process exit: The system cannot find the file specified驱动太新Chrome内核不兼容查自己Chrome版本地址栏输入chrome://version看「Google Chrome」行。查驱动版本CMD中执行chromedriver.exe --version。官方匹配表https://chromedriver.chromium.org/ 注意此站已归档以chrome-for-testing为准4. WebDriver驱动部署PATH陷阱、权限拦截与中文路径血泪史4.1 PATH设置的致命细节为什么System32里放驱动还是找不到很多人把chromedriver.exe复制到C:\Windows\System32以为这样就进了PATH。但Windows PATH解析有优先级当前目录.\C:\Windows\system32C:\Windows用户PATH环境变量如C:\Users\A\AppData\Local\Programs\Python\Python38\Scripts\系统PATH环境变量如C:\Program Files\Java\jdk-11.0.12\bin问题在于system32只对32位程序有效。而Python 3.8默认是64位它会优先查找C:\Windows\SysWOW6432位系统目录导致system32里的驱动被跳过。正确做法是创建专用驱动目录并加入PATH# 创建目录路径无空格、无中文 mkdir C:\drivers\chromedriver-win64 # 下载对应版本chromedriver.exe放入此目录 # 右键“此电脑”→“属性”→“高级系统设置”→“环境变量” # 在“系统变量”中找到Path → “编辑” → “新建” → 输入 C:\drivers\chromedriver-win64 # 重启CMD使PATH生效✅ 验证PATH是否生效CMD中执行where chromedriver应输出C:\drivers\chromedriver-win64\chromedriver.exe。若返回空说明PATH未更新或路径错误。4.2 Windows Defender SmartScreen拦截驱动文件被“静默删除”的真相当你从GitHub下载chromedriver.exe右键属性常看到「此文件来自互联网可能不安全」。Windows Defender SmartScreen会在首次运行时拦截并在后台删除该文件不提示。现象是where chromedriver能找到但webdriver.Chrome()报FileNotFoundError。解决方法右键chromedriver.exe→ “属性” → 勾选「解除锁定」→ “确定”或在PowerShell中执行Unblock-File -Path C:\drivers\chromedriver-win64\chromedriver.exe 血泪经验SmartScreen日志在Event Viewer → Windows Logs → Application中筛选事件ID1001可查拦截记录。别信“杀毒软件误报”这是Windows原生行为。4.3 中文路径/空格路径Selenium启动Chrome时的静默崩溃如果你的项目路径是C:\我的项目\test\或C:\Project with space\Selenium 4.x在构造Chrome启动参数时会将--user-data-dirC:\我的项目\test\profile这样的参数传给Chrome而Chrome进程无法解析含中文或空格的路径直接退出driver对象创建失败。解决方案只有两个强制使用英文路径项目根目录必须是纯ASCII如C:\webtest\显式指定用户数据目录为英文路径from selenium import webdriver from selenium.webdriver.chrome.options import Options options Options() options.add_argument(--user-data-dirC:/temp/chrome_profile) # 注意正斜杠或双反斜杠 options.add_argument(--profile-directoryDefault) driver webdriver.Chrome(optionsoptions) 提示C:/temp/比C:\temp\更安全因为正斜杠在Python字符串中无需转义且Windows API完全兼容。5. 避坑Windows 10下Selenium环境搭建的五个真实翻车现场5.1 现象ModuleNotFoundError: No module named selenium明明pip list里有原因CMD中执行pip install selenium时实际安装到了Python 3.9环境但python命令调用的是Python 3.8。Windows中py -3.8和py -3.9可能指向不同解释器而python命令的映射由py.exe启动器决定与PATH中哪个python.exe排第一有关。解决统一用py -3.8 -m pip install selenium安装并用py -3.8 -c import selenium; print(selenium.__version__)验证。5.2 现象WebDriverException: Message: unknown error: Chrome failed to start: exited abnormally原因Chrome被公司组策略禁用或安装了广告拦截插件如uBlock Origin干扰WebDriver启动。Selenium启动的Chrome是干净实例但某些企业环境会强制注入代理或安全策略。解决添加Chrome启动参数屏蔽干扰options Options() options.add_argument(--no-sandbox) options.add_argument(--disable-dev-shm-usage) options.add_argument(--disable-gpu) options.add_argument(--disable-extensions) options.add_argument(--disable-plugins-discovery) driver webdriver.Chrome(optionsoptions)5.3 现象TimeoutException: Message: timeout: Timed out receiving message from renderer原因不是网页加载慢而是Chrome驱动与浏览器通信端口被防火墙拦截。Windows Defender防火墙默认阻止chromedriver.exe的网络监听。解决在防火墙设置中为chromedriver.exe添加入站规则允许TCP端口127.0.0.1:xxxx端口号随机可在chrome://version中看「命令行」参数里的--remote-debugging-portXXXX。5.4 现象PyCharm中能跑CMD中python test.py报OSError: [WinError 193] %1 is not a valid Win32 application原因chromedriver.exe是32位而Python是64位或反之。下载的驱动必须与Python架构一致。解决查Python架构python -c import platform; print(platform.architecture())下载对应win32或win64版本驱动。Chrome官方只提供64位驱动所以Python必须是64位。5.5 现象InvalidSessionIdException: Message: invalid session id页面刚打开就报错原因driver.quit()后立即重新创建webdriver.Chrome()但旧会话的Chrome进程未完全退出新会话尝试复用端口失败。解决强制结束残留进程import os os.system(taskkill /F /IM chrome.exe /T) os.system(taskkill /F /IM chromedriver.exe /T) driver webdriver.Chrome()或更优雅地在driver.quit()后加time.sleep(1)再创建新实例。6. 进阶验证用一个真实测试用例闭环检验环境健康度6.1 编写可自检的测试脚本不只是打开网页而是验证整个链路下面这个脚本不是为了测试某个网站而是为了证明你的环境每一环都在线。它会检查Chrome浏览器是否存在且可执行检查chromedriver是否能启动并建立会话检查网络连通性访问httpbin.org检查DOM交互能力输入、点击、断言最后生成HTML报告标记各环节状态# health_check.py import time import subprocess import sys from selenium import webdriver from selenium.webdriver.chrome.options import Options from selenium.webdriver.common.by import By from selenium.webdriver.support.ui import WebDriverWait from selenium.webdriver.support import expected_conditions as EC def check_chrome_installed(): try: result subprocess.run([chrome.exe, --version], capture_outputTrue, textTrue, shellTrue, timeout5) return Google Chrome in result.stdout except: return False def check_driver_health(): options Options() options.add_argument(--headless) # 无头模式不弹窗 options.add_argument(--no-sandbox) options.add_argument(--disable-dev-shm-usage) try: driver webdriver.Chrome(optionsoptions) driver.get(https://httpbin.org/get) assert driver.title HTTPBin # 测试DOM交互 driver.get(https://httpbin.org/forms/post) input_elem WebDriverWait(driver, 10).until( EC.presence_of_element_located((By.NAME, comments)) ) input_elem.send_keys(health_check_test) driver.find_element(By.XPATH, //input[typesubmit]).click() # 检查提交后页面是否包含关键词 assert health_check_test in driver.page_source driver.quit() return True except Exception as e: print(fDriver test failed: {e}) return False if __name__ __main__: print( Web Automation Health Check ) print(fPython version: {sys.version}) print(fChrome installed: {✓ if check_chrome_installed() else ✗}) if not check_chrome_installed(): print(ERROR: Chrome browser not found. Please install Chrome first.) sys.exit(1) print(fDriver browser handshake: {✓ if check_driver_health() else ✗}) if not check_driver_health(): print(ERROR: WebDriver failed to communicate with Chrome.) print(Check: 1) chromedriver in PATH, 2) Chrome version match, 3) SmartScreen unlocked) sys.exit(1) print(✅ All checks passed! Your Web automation environment is healthy.) 关键参数说明--headless避免弹窗干扰适合CI/CD或后台运行--no-sandbox绕过Linux沙箱限制Windows下也建议加防权限问题WebDriverWait显式等待比time.sleep()更可靠避免因网速波动导致的随机失败httpbin.org专为HTTP测试设计的免费服务响应稳定无广告干扰6.2 运行验证与结果解读如何从报错信息定位具体故障点将上述脚本保存为health_check.py在CMD中执行cd /d C:\webtest python health_check.py预期成功输出 Web Automation Health Check Python version: 3.8.10 (tags/v3.8.10:3d8993a, May 3 2021, 11:48:03) [MSC v.1929 64 bit (AMD64)] Chrome installed: ✓ Driver browser handshake: ✓ ✅ All checks passed! Your Web automation environment is healthy.若失败按顺序排查Chrome installed: ✗→ 检查Chrome是否安装路径是否在PATH中where chrome.exeDriver browser handshake: ✗→ 查看具体报错SessionNotCreatedException→ 驱动版本不匹配用chrome --version和chromedriver --version对比TimeoutException→ 防火墙拦截检查chrome://version中--remote-debugging-port对应的端口NoSuchWindowException→ Chrome进程被杀检查任务管理器中chrome.exe是否残留6.3 从那以后我每次重装系统或换电脑都强制走一遍这个健康检查不是为了炫技是因为我经历过太多次在客户现场演示前2小时发现webdriver.Chrome()突然不工作翻遍日志才发现是Windows更新重置了SmartScreen策略chromedriver.exe又被锁了。现在我的标准动作是装完Python → 装完Chrome → 运行health_check.py→ 通过才开始写业务脚本。这个脚本已经迭代了11个版本从最初的driver.get(https://www.google.com)到现在覆盖网络、DOM、JS执行、会话管理的全链路。它不解决所有问题但它能帮你把「环境问题」和「脚本逻辑问题」彻底分开——前者花5分钟修复后者才值得你投入调试时间。希望帮到你。本文还有配套的精品资源点击获取

读完文章,也想定制专属网站?

尧图设计师 24 小时内与您沟通定制方案

免费获取报价 →
↑