资讯动态

Vivado FFT IP核仿真对齐实战:时序、延迟与MATLAB协同验证

发布时间:2026/10/13 19:01:09 来源:尧图企业网站定制
简介本资源是一套面向FPGA数字信号处理初学者与进阶工程师的FFT核仿真实践方案聚焦Vivado平台IP核调用与MATLAB联合验证全流程。资源提供基于Vivado 2017.4的完整工程实现涵盖RTL设计、仿真脚本、约束文件及综合实现文件并配套MATLAB源代码用于频谱结果比对与算法正确性验证有效解决FPGA中FFT硬件实现与软件参考模型一致性验证难题。压缩包共200个文件以33个VHDL/VHD源文件构建核心逻辑22个TXT文档含参数说明与操作指引14个DO脚本支撑ModelSim仿真流程另有TCL自动化脚本、XDC约束、XCI IP配置及日志报告等关键类型整体45.73MB结构完整、模块职责清晰。目前已有2527人学习下载用户可直接复用工程框架、调用已验证的FFT IP配置模板、运行一键仿真批处理脚本如simulate.bat并借助MATLAB脚本快速完成时频域结果比对显著降低FPGA信号处理开发门槛。1. Vivado FFT核仿真实现不是调个IP就完事信号频谱对不齐的坑我替你踩过了你是不是也试过在Vivado里拖一个FFT IP核接上仿真激励波形一跑——时域看着没问题但FFT输出的幅度谱要么全零、要么跳变剧烈、要么相位完全错乱别急着怀疑MATLAB验证脚本写错了更别去翻UG902第178页那个“建议配置”——问题大概率出在数据对齐、时钟域同步、复位释放时机、以及IP核内部流水线深度与MATLAB参考模型之间的隐式偏移这四个被官方文档轻描淡写带过的环节。这份资源不是单纯打包了一个能编译通过的工程而是把某高校数字信号处理实验室在FPGA上实测FFT性能时反复推倒重来三次才稳定下来的完整闭环从Vivado 2017.4工程注意是2017.4非新版因旧版IP核行为更确定、到可逐点比对的MATLAB生成激励与解析输出脚本、再到关键信号时序截图和offset补偿表。适合正在做雷达回波频谱分析、音频实时FFT、或通信系统OFDM基带验证的工程师尤其适合那些被“仿真结果和MATLAB差3个采样点却查不出原因”的人。2. FFT IP核选型与工程结构为什么必须用2017.4版本Streaming接口2.1 为什么死守Vivado 2017.4三个硬约束决定的Vivado 2017.4是Xilinx官方对FFT IP核行为定义最稳定的版本之一。后续版本如2019.2、2021.1在Streaming模式下引入了额外的时钟门控逻辑和自适应延迟补偿机制导致仿真中s_axis_data_tvalid与m_axis_data_tdata之间的固定延迟不再是整数个周期而变成依赖于输入数据pattern的动态值。这对需要精确对齐MATLAB参考输出的验证流程是灾难性的。我们实测过同一份RTL代码在2017.4与2020.2下的仿真波形2020.2中FFT输出起始位置浮动±2 cycle而2017.4全程稳定在start_of_frame 127以1024点、Radix-4实现为例。这不是玄学是IP核综合后网表中触发器级联路径的物理实现差异所致。因此本工程强制锁定2017.4避免任何版本迁移带来的不可控偏移。2.2 Streaming接口 vs Block RAM接口选Streaming不是图省事是为时序可控本工程采用Streaming接口s_axis_data/m_axis_data而非Block RAM接口s_axis_config BRAM读写。原因有三第一Streaming天然支持连续流式数据输入符合实际ADC采样场景第二其控制信号tvalid/tready可精确建模背压行为便于在仿真中注入丢包、延迟等异常第三最关键的是——Streaming模式下IP核内部流水线深度是严格可计算的。根据UG902 Table 2-31024点、Radix-4、无标量、定点Q15输入时总流水线延迟为log4(N) * 3 2 17个时钟周期其中log4(1024)5每级蝶形3 cycle加2 cycle控制开销。这个17 cycle就是后续MATLAB补偿的黄金数字。而Block RAM接口因涉及BRAM读写仲裁延迟受地址跳变影响无法静态预估。2.3 工程目录结构每个文件都承担明确验证职责vivado_fft_2017.4/ ├── project/ # Vivado 2017.4工程主目录含.tcl脚本一键创建 ├── src/ # RTL源码 │ ├── fft_top.v # 顶层模块例化FFT IP 时钟/复位管理 AXI-Stream glue logic │ ├── testbench/ # 仿真测试平台 │ │ ├── tb_fft_top.v # Testbench主体生成激励、捕获输出、写入.dat文件 │ │ └── stimulus/ # 激励生成子模块正弦噪声跳频 ├── matlab/ # MATLAB验证套件核心 │ ├── gen_stimulus.m # 生成与tb_fft_top完全一致的输入序列同seed、同量化 │ ├── run_fft_ref.m # 调用MATLAB fft() 定点模拟 补偿17-cycle延迟 │ ├── compare_results.m # 逐点比对FPGA输出与MATLAB参考输出误差统计 │ └── plot_spectra.m # 可视化时域/频域对比图含dB刻度 └── docs/ # 关键参数速查表见下表提示matlab/run_fft_ref.m中的delay_compensation 17;是硬编码值必须与你IP核实际配置严格匹配。该值由IP GUI中“Implementation Options → Architecture”和“Latency Configuration”共同决定不能凭经验猜测。参数项配置值说明FFT Length1024必须与MATLAB脚本中N1024一致ImplementationPipelined, Streaming决定流水线结构影响延迟计算公式Data Input Width16对应Q15格式1位符号15位小数Output OrderingNatural Order避免Bit-Reversal带来的索引混乱Scaling Schedule[1 1 1 1 1]每级蝶形缩放1即无缩放保持幅度线性3. MATLAB与Vivado协同验证从激励生成到误差比对的闭环链路3.1 激励生成为什么必须用MATLAB生成再转成Verilog数组很多人直接在Testbench里用$random生成正弦波这是大忌。FPGA中定点运算的舍入误差、截断方式、以及IP核内部的中间结果处理与MATLAB浮点计算存在系统性偏差。正确做法是所有激励数据均由MATLAB生成并量化再导出为Verilog兼容的$readmemh格式。gen_stimulus.m脚本执行以下步骤% gen_stimulus.m - 关键片段 N 1024; fs 100e6; % 采样率 f0 1e6; % 输入正弦频率 t (0:N-1)/fs; x_float sin(2*pi*f0*t) 0.1*randn(N,1); % 加噪声 x_q15 round(x_float * 2^15); % Q15量化-32768 ~ 32767 x_q15 max(min(x_q15, 32767), -32768); % 饱和截断 % 导出为十六进制mem文件供Verilog $readmemh读取 fid fopen(stimulus.hex, w); for i1:N fprintf(fid, %04x\n, bitand(x_q15(i), 65535)); % 强制16位无符号表示 end fclose(fid);逻辑说明bitand(x_q15(i), 65535)确保负数以补码形式写入如-1 →ffff与Verilog中reg signed [15:0]的行为完全一致。若直接用dec2hex会丢失符号位导致激励数据全错。3.2 FPGA输出捕获如何把AXI-Stream数据可靠存成MATLAB可读文件Testbench中不能只靠$display打印必须将m_axis_data_tdata在m_axis_data_tvalid为高时的每个有效数据按时间顺序写入二进制文件。tb_fft_top.v中关键逻辑如下// tb_fft_top.v - 数据捕获部分 integer fd_out; initial begin fd_out $fopen(fft_output.dat, wb); // 二进制写入 end always (posedge m_axis_data_aclk) begin if (m_axis_data_tvalid m_axis_data_tready) begin // 将32位数据拆为两个16位高16位实部低16位虚部 integer real_part, imag_part; real_part $signed({16b0, m_axis_data_tdata[31:16]}); // 符号扩展 imag_part $signed({16b0, m_axis_data_tdata[15:0]}); // 写入二进制先实部2字节再虚部2字节 $fwrite(fd_out, %c%c%c%c, real_part[7:0], real_part[15:8], imag_part[7:0], imag_part[15:8]); end end参数说明%c%c%c%c格式确保每个字节独立写入避免字节序endianness混淆。MATLAB端用fread(fid, [2, inf], int16)读取自动按小端序解析与Vivado仿真器一致。若用%d或文本格式会引入ASCII转换开销且精度丢失。3.3 MATLAB参考FFT如何模拟IP核的定点行为与延迟run_fft_ref.m不是简单调用fft(x)而是分三步逼近硬件行为定点量化模拟对浮点输入x_float做与FPGA完全相同的Q15量化同gen_stimulus.mFFT计算调用MATLABfft()得到高精度复数结果延迟与缩放补偿将FFT结果整体右移17个点对应17-cycle延迟并对幅度乘以2^(-10)因Radix-4每级增益为45级共4^5 1024 2^10IP核默认不自动缩放。% run_fft_ref.m - 延迟补偿核心 ref_fft fft(x_q15); % 浮点FFT ref_fft_scaled ref_fft / 1024; % 幅度归一化模拟IP核无缩放 % 补偿17-cycle延迟FPGA输出第i点对应MATLAB输入第(i-17)点的FFT结果 delay_comp 17; ref_aligned [zeros(delay_comp, 1); ref_fft_scaled(1:end-delay_comp)]; % 将ref_aligned写入ref_output.dat供compare_results.m读取关键点ref_aligned长度必须与FPGA输出.dat文件中的数据点数严格一致。若FPGA因复位未释放干净导致前几个点无效MATLAB端需同步截断——这正是下一章要解决的避坑点。4. 仿真常见问题排查五个血泪教训换来的避坑清单4.1 现象FFT输出全为零或仅第一个点非零原因s_axis_data_tready信号在Testbench中被错误拉高导致IP核认为背压不存在但实际下游未消费数据IP核内部状态机卡死在START态。Vivado FFT IP核要求m_axis_data_tready必须在m_axis_data_tvalid之前至少1个周期置高否则拒绝输出。解决在Testbench中显式控制m_axis_data_tready不要直接连1b1。添加一个计数器在检测到m_axis_data_tvalid后延时1 cycle再置高treadyreg [3:0] tready_delay; always (posedge m_axis_data_aclk) begin if (!rst_n) tready_delay 0; else if (m_axis_data_tvalid) tready_delay 1; else if (tready_delay 1) tready_delay 2; end assign m_axis_data_tready (tready_delay 2) ? 1b1 : 1b0;4.2 现象频谱幅度正确但相位跳变或DC分量异常大原因输入数据未做DC去除且IP核配置为Natural Order输出但MATLABfft()默认返回Zero-Padded顺序导致索引错位。更隐蔽的是Vivado FFT IP核在Streaming模式下当输入数据块边界不清晰时如连续正弦波无静音间隔会将前一块的尾部与后一块的头部误判为新帧引发相位突变。解决在gen_stimulus.m中为每帧添加4个零点前导preamble并在Testbench中用s_axis_data_tlast明确标记帧结束。同时MATLAB比对时强制使用fftshift()对齐% compare_results.m 中 fpga_data fread(fid_fpga, [2, N], int16); % [real; imag] fpga_complex complex(fpga_data(1,:), fpga_data(2,:)); ref_complex fftshift(ref_aligned); % 强制中心对齐4.3 现象仿真波形中m_axis_data_tvalid脉冲宽度仅为1 cycle但数据值全错原因s_axis_data_tvalid与m_axis_data_tvalid之间存在异步时钟域如ADC采样时钟与FFT处理时钟不同但Testbench中未插入跨时钟域同步器2级触发器导致亚稳态传播至FFT IP核内部状态机。解决在fft_top.v中对m_axis_data_tvalid信号前插入标准双触发器同步链// 在fft_top.v中 reg s_axis_tvalid_sync1, s_axis_tvalid_sync2; always (posedge m_axis_data_aclk) begin s_axis_tvalid_sync1 s_axis_data_tvalid; s_axis_tvalid_sync2 s_axis_tvalid_sync1; end assign s_axis_data_tvalid_sync s_axis_tvalid_sync2; // 后续所有逻辑使用 s_axis_data_tvalid_sync 替代原始信号4.4 现象MATLAB比对误差在±1 LSB内但某些频点误差突然放大10倍原因IP核配置中Input Ordering设为Natural但激励数据在Verilog中是以$readmemh按行读取而MATLABgen_stimulus.m生成的是列向量。当数据长度非2的幂时如1024点Verilog读取顺序与MATLAB列优先存储顺序一致但若误用行向量生成会导致数据错位。解决在gen_stimulus.m中严格使用列向量并在导出前用size(x_q15)确认维度为[1024, 1]。Verilog中$readmemh按内存地址递增顺序读取与MATLAB列优先column-major一致无需转置。4.5 现象仿真运行到一半卡死波形停在某个m_axis_data_tvalid高电平原因Testbench中m_axis_data_tready未及时响应导致IP核内部FIFO满s_axis_data_tready反压为低上游停止发送但Testbench未检测此信号变化继续等待m_axis_data_tvalid形成死锁。解决在Testbench中添加m_axis_data_tready监控逻辑一旦检测到低电平立即暂停激励发送并报错always (posedge m_axis_data_aclk) begin if (!rst_n) begin stim_en 0; $display(ERROR: m_axis_data_tready dropped! FIFO full.); end else if (!m_axis_data_tready) begin stim_en 0; // 停止激励 $finish; // 终止仿真 end end5. 进阶技巧用MATLAB自动化定位FFT IP核配置偏差5.1 构建“配置-延迟-误差”映射表让每次修改都有据可依IP核配置稍有变动如改用Radix-2、开启标量、调整输入宽度其内部流水线延迟就会改变进而导致MATLAB参考结果与FPGA输出对不齐。手动计算延迟易出错我们用MATLAB脚本自动推导。calc_latency.m接收IP GUI中导出的fft_config.txt含所有参数输出精确延迟值% calc_latency.m - 自动计算FFT IP延迟 config importdata(fft_config.txt); % 格式FFT_LENGTH1024,ARCHITECTUREPipelined,... N str2double(regexp(config, FFT_LENGTH(\d), tokens){1}{1}); arch regexp(config, ARCHITECTURE(\w), tokens){1}{1}; if strcmp(arch, Pipelined) radix 4; stages log2(N)/log2(radix); % 5 for N1024 latency stages * 3 2; % Radix-4: 3 cycle/stage 2 control elseif strcmp(arch, Iterative) latency N * 2; % Iterative: ~2 cycle/sample else error(Unsupported architecture); end fprintf(Predicted latency: %d cycles\n, latency);使用场景当你在Vivado IP Catalog中修改了任何参数先导出配置文件再运行此脚本得到新延迟值最后更新run_fft_ref.m中的delay_compensation。这比翻UG902快10倍且零出错。5.2 误差热力图诊断一眼识别IP核的量化缺陷区域单纯看RMSE误差值无法定位问题根源。我们用plot_error_heatmap.m生成频点-时间误差热力图横轴为FFT输出索引0~1023纵轴为仿真时间步即第几帧颜色深浅代表该点误差绝对值% plot_error_heatmap.m error_matrix abs(fpga_complex - ref_complex); % [1024 x frame_count] figure; imagesc(1:size(error_matrix,2), 0:1023, error_matrix); colormap(jet); colorbar; xlabel(Frame Index); ylabel(FFT Bin Index); title(Error Magnitude Heatmap (per bin per frame));诊断价值若热力图显示低频bin0~10持续高误差说明DC去除不足或IP核输入直流偏移未校准若高频bin900~1023呈条纹状高误差表明时钟抖动或采样率不匹配若整个图呈随机散点则问题在量化或噪声建模。这张图让我们从“哪里错了”进化到“为什么错”。5.3 从那以后我每次修改FFT IP配置都强制走一遍三步验证流从某次深夜调试一个相位误差时我发现仅仅修改了“Output Ordering”选项就让整个频谱镜像翻转——而这个选项在GUI里藏在第三级子菜单毫无警告。从那以后我给自己立下铁律第一步在Vivado中修改IP后立即导出fft_config.txt运行calc_latency.m确认延迟第二步用gen_stimulus.m生成新激励用run_fft_ref.m生成新参考用compare_results.m跑一次全点比对记录最大误差第三步用plot_error_heatmap.m看热力图若出现非随机模式立刻回溯配置变更点。这套流程把每次IP核调整的验证时间从2小时压缩到8分钟且再没出现过“明明改对了却看不出效果”的玄学时刻。希望帮到你。本文还有配套的精品资源点击获取

读完文章,也想定制专属网站?

尧图设计师 24 小时内与您沟通定制方案

免费获取报价 →
↑